{"text_format":"2","workbook":"xlsx","n_sheets":7,"sheets":["rtr","g_m","Hoja4","oor","ooi","cf","cnfff"],"not_rendered":{"charts":0,"images":1,"macros":0,"external_links":0,"defined_names":5,"comments":0,"pivot_tables":0},"unopened":[],"bounds":{"document_bytes":16777216,"sheet_cells":100000,"run_cost":"one","rows_first":2000,"rows_last":500,"rows_between":2000,"halvings":0,"cell_chars":16384,"cell_head_chars":4096},"cells_cut":0,"cells_raw":0,"read":"whole","date_system":"1900"}

{"sheet":"rtr","index":0,"n_rows":836,"n_cols":7,"rows_kept":836,"cut":false,"hidden":false,"merged":[]}
["BUS_I","BUS_J","ID_CKT","X","R","CTOIJ","CTOJI"]
[4345,4346,"1",2.9559999999999999E-2,6.8900000000000003E-3,134,134]
[4400,4405,"1",1.9499999999999999E-3,2.9999999999999997E-4,70,70]
[4401,4406,"1",2.8799999999999999E-2,4.4999999999999997E-3,225.4,225.4]
[4402,4404,"1",7.1760000000000004E-2,1.119E-2,300,300]
[4402,4405,"1",4.4200000000000003E-3,6.8999999999999997E-4,225.4,225.4]
[4402,4405,"2",4.4200000000000003E-3,6.8999999999999997E-4,225.4,225.4]
[4402,4406,"1",5.4489999999999997E-2,9.9799999999999993E-3,367,367]
[4402,4411,"1",0.10664999999999999,1.6490000000000001E-2,367,367]
[4403,4407,"1",6.6909999999999997E-2,1.034E-2,225.4,225.4]
[4404,4406,"1",1.4449999999999999E-2,2.2599999999999999E-3,225.4,225.4]
[4406,4412,"1",0.1157,1.789E-2,367,367]
[4408,50000,"1",6.2100000000000002E-2,9.5300000000000003E-3,230,230]
[4412,50050,"1",0.11835,1.83E-2,338,338]
[4750,4803,"1",3.5999999999999999E-3,5.9999999999999995E-4,240,240]
[6000,56050,"1",3.3529999999999997E-2,5.7200000000000003E-3,300,300]
[6000,6014,"1",9.4999999999999998E-3,1.6900000000000001E-3,193,193]
[6001,6003,"1C",1.17E-2,2.3999999999999998E-3,335,335]
[6001,6005,"3A",3.5000000000000003E-2,6.7999999999999996E-3,247,247]
[6001,6005,"4A",3.5000000000000003E-2,6.7999999999999996E-3,247,247]
[6002,6018,"12",2.5999999999999999E-3,5.9999999999999995E-4,120,120]
[6002,6018,"37",1.73E-3,3.6999999999999999E-4,142,142]
[6002,6024,"3A",8.4370000000000001E-2,1.553E-2,168,168]
[6002,6036,"7",4.8599999999999997E-3,1.1789999999999999E-3,120,120]
[6002,6170,"4A",0.11887,2.188E-2,120,120]
[6003,6171,"1B",1.7309999999999999E-2,3.63E-3,202,202]
[6005,6105,"11",3.8000000000000002E-4,4.0000000000000003E-5,193,193]
[6005,6240,"4B",7.2330000000000005E-2,1.404E-2,247,247]
[6008,6182,"5A",0.101482,1.7909000000000001E-2,247,247]
[6008,6240,"4C",5.237E-2,1.0160000000000001E-2,350,350]
[6011,6096,"7",3.3700000000000001E-2,6.4999999999999997E-3,193,193]
[6011,6096,"8",3.3700000000000001E-2,6.4999999999999997E-3,193,193]
[6011,6182,"5B",8.0750000000000002E-2,1.5679999999999999E-2,247,247]
[6011,6380,"9A",2.64E-2,4.7000000000000002E-3,248,248]
[6012,6087,"15",9.5299999999999996E-2,1.8200000000000001E-2,93,93]
[6012,6087,"16",9.5299999999999996E-2,1.8200000000000001E-2,150,150]
[6014,6380,"9B",2.64E-2,4.7000000000000002E-3,248,248]
[6018,6123,"5",3.5200000000000002E-2,9.1999999999999998E-3,100,100]
[6018,6173,"1A",0.16172400000000001,3.1580999999999998E-2,150,150]
[6018,6173,"2A",0.16172400000000001,3.1580999999999998E-2,150,150]
[6024,6060,"3B",0.11812,2.1739999999999999E-2,168,168]
[6059,6066,"30",3.1570000000000001E-2,7.6649999999999999E-3,120,120]
[6059,6074,"23",4.0000000000000002E-4,0,90.6,90.6]
[6059,6173,"2B",2.2409999999999999E-2,4.3660000000000001E-3,211,211]
[6059,6270,"0A",5.0000000000000001E-4,5.0000000000000001E-4,93,93]
[6059,6290,"1C",2.5300000000000001E-3,4.6999999999999999E-4,211,211]
[6060,6074,"26",4.0000000000000002E-4,0,90.6,90.6]
[6060,6170,"4B",9.2619999999999994E-2,1.7049999999999999E-2,120,120]
[6060,6270,"0B",5.0000000000000001E-4,5.0000000000000001E-4,93,93]
[6087,6088,"17",2.0400000000000001E-2,4.1999999999999997E-3,93,93]
[6087,6092,"18",7.0000000000000001E-3,1.5E-3,93,93]
[6096,6179,"18",1.4399E-2,1.6149999999999999E-3,290,290]
[6096,6263,"0A",9.0589000000000003E-2,1.5886999999999998E-2,304,304]
[6100,6171,"1A",4.367E-2,9.1500000000000001E-3,202,202]
[6170,6280,"43",7.3299999999999997E-3,1.5900000000000001E-3,159,159]
[6173,6290,"1B",2.2769999999999999E-2,4.3E-3,211,211]
[6178,6179,"19",1.8600000000000001E-3,2.2000000000000001E-4,193,193]
[6179,6182,"16",7.7799999999999994E-2,8.5000000000000006E-3,275,275]
[6179,6182,"17",7.7799999999999994E-2,8.5000000000000006E-3,275,275]
[6179,6360,"22",3.0500000000000002E-3,5.4200000000000003E-3,131,131]
[6179,6340,"29",3.9600000000000003E-2,4.4400000000000004E-3,276,276]
[6260,6263,"0B",2.239E-2,3.9269999999999999E-3,304,304]
[6260,6340,"30",7.1190000000000003E-2,1.2485E-2,304,304]
[6260,6400,"21",1.4760000000000001E-2,2.4399999999999999E-3,304,304]
[6360,6363,"23",4.0600000000000002E-3,7.2300000000000003E-3,131,131]
[6363,6366,"24",3.5500000000000002E-3,6.3299999999999997E-3,131,131]
[6400,58350,"1",4.3150000000000001E-2,7.1199999999999996E-3,333,333]
[6500,56050,"1",2.068E-2,3.2000000000000002E-3,338,338]
[12007,12195,"1",6.028E-2,2.1860000000000001E-2,83.8,83.8]
[12007,12225,"1",2.9739999999999999E-2,9.7800000000000005E-3,83.8,83.8]
[12036,12089,"1",6.6600000000000001E-3,2E-3,83.8,83.8]
[12036,12257,"1",1.387E-2,4.5100000000000001E-3,83.8,83.8]
[12047,12142,"1",7.9000000000000001E-4,1.9000000000000001E-4,94.4,94.4]
[12049,12239,"1",9.1800000000000007E-3,2.8999999999999998E-3,83.8,83.8]
[12094,12251,"1",8.8100000000000001E-3,4.8599999999999997E-3,51.2,51.2]
[12127,12129,"1",2.5600000000000001E-2,1.374E-2,58,58]
[12127,12239,"1",4.2840000000000003E-2,1.355E-2,83.8,83.8]
[12129,12154,"1",1.0659999999999999E-2,3.47E-3,83.8,83.8]
[12142,12205,"1",5.101E-2,1.2370000000000001E-2,94.41,94.41]
[12154,12257,"1",5.6600000000000001E-3,1.8400000000000001E-3,83.8,83.8]
{"$rows_left_out":757}
{"sheet":"g_m","index":1,"n_rows":557,"n_cols":3,"rows_kept":557,"cut":false,"hidden":false,"merged":[]}
["Nodo","Generacion","Demanda"]
[1101,{"$f":"IFERROR(VLOOKUP(A2,Hoja4!$A$2:$B$163,2,0),0)","v":228.126},{"$f":"IFERROR(VLOOKUP(A2,Hoja4!$D$2:$E$165,2,0),0)","v":0}]
[1102,{"$f":"IFERROR(VLOOKUP(A3,Hoja4!$A$2:$B$163,2,0),0)","v":24.591099999999997},{"$f":"IFERROR(VLOOKUP(A3,Hoja4!$D$2:$E$165,2,0),0)","v":28.998000000000001}]
[1103,{"$f":"IFERROR(VLOOKUP(A4,Hoja4!$A$2:$B$163,2,0),0)","v":0},{"$f":"IFERROR(VLOOKUP(A4,Hoja4!$D$2:$E$165,2,0),0)","v":0}]
[1105,{"$f":"IFERROR(VLOOKUP(A5,Hoja4!$A$2:$B$163,2,0),0)","v":0},{"$f":"IFERROR(VLOOKUP(A5,Hoja4!$D$2:$E$165,2,0),0)","v":0}]
[1106,{"$f":"IFERROR(VLOOKUP(A6,Hoja4!$A$2:$B$163,2,0),0)","v":3.7665999999999999},{"$f":"IFERROR(VLOOKUP(A6,Hoja4!$D$2:$E$165,2,0),0)","v":27.231000000000002}]
[1107,{"$f":"IFERROR(VLOOKUP(A7,Hoja4!$A$2:$B$163,2,0),0)","v":0},{"$f":"IFERROR(VLOOKUP(A7,Hoja4!$D$2:$E$165,2,0),0)","v":141.916}]
[1108,{"$f":"IFERROR(VLOOKUP(A8,Hoja4!$A$2:$B$163,2,0),0)","v":0},{"$f":"IFERROR(VLOOKUP(A8,Hoja4!$D$2:$E$165,2,0),0)","v":155.47800000000001}]
[1109,{"$f":"IFERROR(VLOOKUP(A9,Hoja4!$A$2:$B$163,2,0),0)","v":0},{"$f":"IFERROR(VLOOKUP(A9,Hoja4!$D$2:$E$165,2,0),0)","v":228.24099999999999}]
[1110,{"$f":"IFERROR(VLOOKUP(A10,Hoja4!$A$2:$B$163,2,0),0)","v":0},{"$f":"IFERROR(VLOOKUP(A10,Hoja4!$D$2:$E$165,2,0),0)","v":0}]
[1111,{"$f":"IFERROR(VLOOKUP(A11,Hoja4!$A$2:$B$163,2,0),0)","v":0},{"$f":"IFERROR(VLOOKUP(A11,Hoja4!$D$2:$E$165,2,0),0)","v":0}]
[1113,{"$f":"IFERROR(VLOOKUP(A12,Hoja4!$A$2:$B$163,2,0),0)","v":0},{"$f":"IFERROR(VLOOKUP(A12,Hoja4!$D$2:$E$165,2,0),0)","v":0}]
[1114,{"$f":"IFERROR(VLOOKUP(A13,Hoja4!$A$2:$B$163,2,0),0)","v":0},{"$f":"IFERROR(VLOOKUP(A13,Hoja4!$D$2:$E$165,2,0),0)","v":0}]
[1115,{"$f":"IFERROR(VLOOKUP(A14,Hoja4!$A$2:$B$163,2,0),0)","v":0},{"$f":"IFERROR(VLOOKUP(A14,Hoja4!$D$2:$E$165,2,0),0)","v":0}]
[1117,{"$f":"IFERROR(VLOOKUP(A15,Hoja4!$A$2:$B$163,2,0),0)","v":0},{"$f":"IFERROR(VLOOKUP(A15,Hoja4!$D$2:$E$165,2,0),0)","v":0}]
[1119,{"$f":"IFERROR(VLOOKUP(A16,Hoja4!$A$2:$B$163,2,0),0)","v":0},{"$f":"IFERROR(VLOOKUP(A16,Hoja4!$D$2:$E$165,2,0),0)","v":0}]
[1120,{"$f":"IFERROR(VLOOKUP(A17,Hoja4!$A$2:$B$163,2,0),0)","v":0},{"$f":"IFERROR(VLOOKUP(A17,Hoja4!$D$2:$E$165,2,0),0)","v":2.0164}]
[1121,{"$f":"IFERROR(VLOOKUP(A18,Hoja4!$A$2:$B$163,2,0),0)","v":0},{"$f":"IFERROR(VLOOKUP(A18,Hoja4!$D$2:$E$165,2,0),0)","v":0}]
[1122,{"$f":"IFERROR(VLOOKUP(A19,Hoja4!$A$2:$B$163,2,0),0)","v":0},{"$f":"IFERROR(VLOOKUP(A19,Hoja4!$D$2:$E$165,2,0),0)","v":0}]
[1124,{"$f":"IFERROR(VLOOKUP(A20,Hoja4!$A$2:$B$163,2,0),0)","v":0},{"$f":"IFERROR(VLOOKUP(A20,Hoja4!$D$2:$E$165,2,0),0)","v":52.25}]
[1126,{"$f":"IFERROR(VLOOKUP(A21,Hoja4!$A$2:$B$163,2,0),0)","v":0},{"$f":"IFERROR(VLOOKUP(A21,Hoja4!$D$2:$E$165,2,0),0)","v":64.412800000000004}]
[1128,{"$f":"IFERROR(VLOOKUP(A22,Hoja4!$A$2:$B$163,2,0),0)","v":0},{"$f":"IFERROR(VLOOKUP(A22,Hoja4!$D$2:$E$165,2,0),0)","v":0}]
[1129,{"$f":"IFERROR(VLOOKUP(A23,Hoja4!$A$2:$B$163,2,0),0)","v":0},{"$f":"IFERROR(VLOOKUP(A23,Hoja4!$D$2:$E$165,2,0),0)","v":0}]
[1131,{"$f":"IFERROR(VLOOKUP(A24,Hoja4!$A$2:$B$163,2,0),0)","v":0},{"$f":"IFERROR(VLOOKUP(A24,Hoja4!$D$2:$E$165,2,0),0)","v":0}]
[1132,{"$f":"IFERROR(VLOOKUP(A25,Hoja4!$A$2:$B$163,2,0),0)","v":0},{"$f":"IFERROR(VLOOKUP(A25,Hoja4!$D$2:$E$165,2,0),0)","v":0}]
[1133,{"$f":"IFERROR(VLOOKUP(A26,Hoja4!$A$2:$B$163,2,0),0)","v":0},{"$f":"IFERROR(VLOOKUP(A26,Hoja4!$D$2:$E$165,2,0),0)","v":26.213000000000001}]
[1140,{"$f":"IFERROR(VLOOKUP(A27,Hoja4!$A$2:$B$163,2,0),0)","v":125.8304},{"$f":"IFERROR(VLOOKUP(A27,Hoja4!$D$2:$E$165,2,0),0)","v":33.764000000000003}]
[1141,{"$f":"IFERROR(VLOOKUP(A28,Hoja4!$A$2:$B$163,2,0),0)","v":180.74199999999999},{"$f":"IFERROR(VLOOKUP(A28,Hoja4!$D$2:$E$165,2,0),0)","v":0}]
[1145,{"$f":"IFERROR(VLOOKUP(A29,Hoja4!$A$2:$B$163,2,0),0)","v":32.902000000000001},{"$f":"IFERROR(VLOOKUP(A29,Hoja4!$D$2:$E$165,2,0),0)","v":13.842000000000001}]
[1151,{"$f":"IFERROR(VLOOKUP(A30,Hoja4!$A$2:$B$163,2,0),0)","v":0},{"$f":"IFERROR(VLOOKUP(A30,Hoja4!$D$2:$E$165,2,0),0)","v":0}]
[1153,{"$f":"IFERROR(VLOOKUP(A31,Hoja4!$A$2:$B$163,2,0),0)","v":0},{"$f":"IFERROR(VLOOKUP(A31,Hoja4!$D$2:$E$165,2,0),0)","v":0}]
[1154,{"$f":"IFERROR(VLOOKUP(A32,Hoja4!$A$2:$B$163,2,0),0)","v":0},{"$f":"IFERROR(VLOOKUP(A32,Hoja4!$D$2:$E$165,2,0),0)","v":0}]
[1155,{"$f":"IFERROR(VLOOKUP(A33,Hoja4!$A$2:$B$163,2,0),0)","v":0},{"$f":"IFERROR(VLOOKUP(A33,Hoja4!$D$2:$E$165,2,0),0)","v":0}]
[1159,{"$f":"IFERROR(VLOOKUP(A34,Hoja4!$A$2:$B$163,2,0),0)","v":0},{"$f":"IFERROR(VLOOKUP(A34,Hoja4!$D$2:$E$165,2,0),0)","v":0}]
[1163,{"$f":"IFERROR(VLOOKUP(A35,Hoja4!$A$2:$B$163,2,0),0)","v":0},{"$f":"IFERROR(VLOOKUP(A35,Hoja4!$D$2:$E$165,2,0),0)","v":0}]
[1164,{"$f":"IFERROR(VLOOKUP(A36,Hoja4!$A$2:$B$163,2,0),0)","v":0},{"$f":"IFERROR(VLOOKUP(A36,Hoja4!$D$2:$E$165,2,0),0)","v":0}]
[1165,{"$f":"IFERROR(VLOOKUP(A37,Hoja4!$A$2:$B$163,2,0),0)","v":45.220999999999997},{"$f":"IFERROR(VLOOKUP(A37,Hoja4!$D$2:$E$165,2,0),0)","v":0}]
[1166,{"$f":"IFERROR(VLOOKUP(A38,Hoja4!$A$2:$B$163,2,0),0)","v":53.082999999999998},{"$f":"IFERROR(VLOOKUP(A38,Hoja4!$D$2:$E$165,2,0),0)","v":0}]
[1168,{"$f":"IFERROR(VLOOKUP(A39,Hoja4!$A$2:$B$163,2,0),0)","v":45.582999999999998},{"$f":"IFERROR(VLOOKUP(A39,Hoja4!$D$2:$E$165,2,0),0)","v":0}]
[1169,{"$f":"IFERROR(VLOOKUP(A40,Hoja4!$A$2:$B$163,2,0),0)","v":0},{"$f":"IFERROR(VLOOKUP(A40,Hoja4!$D$2:$E$165,2,0),0)","v":0}]
[1170,{"$f":"IFERROR(VLOOKUP(A41,Hoja4!$A$2:$B$163,2,0),0)","v":10.196999999999999},{"$f":"IFERROR(VLOOKUP(A41,Hoja4!$D$2:$E$165,2,0),0)","v":0}]
[1174,{"$f":"IFERROR(VLOOKUP(A42,Hoja4!$A$2:$B$163,2,0),0)","v":0},{"$f":"IFERROR(VLOOKUP(A42,Hoja4!$D$2:$E$165,2,0),0)","v":0}]
[1204,{"$f":"IFERROR(VLOOKUP(A43,Hoja4!$A$2:$B$163,2,0),0)","v":0},{"$f":"IFERROR(VLOOKUP(A43,Hoja4!$D$2:$E$165,2,0),0)","v":0}]
[1206,{"$f":"IFERROR(VLOOKUP(A44,Hoja4!$A$2:$B$163,2,0),0)","v":0},{"$f":"IFERROR(VLOOKUP(A44,Hoja4!$D$2:$E$165,2,0),0)","v":0}]
[1207,{"$f":"IFERROR(VLOOKUP(A45,Hoja4!$A$2:$B$163,2,0),0)","v":0},{"$f":"IFERROR(VLOOKUP(A45,Hoja4!$D$2:$E$165,2,0),0)","v":0}]
[1215,{"$f":"IFERROR(VLOOKUP(A46,Hoja4!$A$2:$B$163,2,0),0)","v":0},{"$f":"IFERROR(VLOOKUP(A46,Hoja4!$D$2:$E$165,2,0),0)","v":0}]
[1216,{"$f":"IFERROR(VLOOKUP(A47,Hoja4!$A$2:$B$163,2,0),0)","v":0},{"$f":"IFERROR(VLOOKUP(A47,Hoja4!$D$2:$E$165,2,0),0)","v":0}]
[1217,{"$f":"IFERROR(VLOOKUP(A48,Hoja4!$A$2:$B$163,2,0),0)","v":0},{"$f":"IFERROR(VLOOKUP(A48,Hoja4!$D$2:$E$165,2,0),0)","v":0}]
[1218,{"$f":"IFERROR(VLOOKUP(A49,Hoja4!$A$2:$B$163,2,0),0)","v":0},{"$f":"IFERROR(VLOOKUP(A49,Hoja4!$D$2:$E$165,2,0),0)","v":0}]
[1219,{"$f":"IFERROR(VLOOKUP(A50,Hoja4!$A$2:$B$163,2,0),0)","v":158.19499999999999},{"$f":"IFERROR(VLOOKUP(A50,Hoja4!$D$2:$E$165,2,0),0)","v":0}]
[1220,{"$f":"IFERROR(VLOOKUP(A51,Hoja4!$A$2:$B$163,2,0),0)","v":0},{"$f":"IFERROR(VLOOKUP(A51,Hoja4!$D$2:$E$165,2,0),0)","v":0}]
[1223,{"$f":"IFERROR(VLOOKUP(A52,Hoja4!$A$2:$B$163,2,0),0)","v":0},{"$f":"IFERROR(VLOOKUP(A52,Hoja4!$D$2:$E$165,2,0),0)","v":0}]
[1240,{"$f":"IFERROR(VLOOKUP(A53,Hoja4!$A$2:$B$163,2,0),0)","v":0},{"$f":"IFERROR(VLOOKUP(A53,Hoja4!$D$2:$E$165,2,0),0)","v":0}]
[1241,{"$f":"IFERROR(VLOOKUP(A54,Hoja4!$A$2:$B$163,2,0),0)","v":0},{"$f":"IFERROR(VLOOKUP(A54,Hoja4!$D$2:$E$165,2,0),0)","v":0}]
[1249,{"$f":"IFERROR(VLOOKUP(A55,Hoja4!$A$2:$B$163,2,0),0)","v":0},{"$f":"IFERROR(VLOOKUP(A55,Hoja4!$D$2:$E$165,2,0),0)","v":0}]
[1251,{"$f":"IFERROR(VLOOKUP(A56,Hoja4!$A$2:$B$163,2,0),0)","v":0},{"$f":"IFERROR(VLOOKUP(A56,Hoja4!$D$2:$E$165,2,0),0)","v":0}]
[1301,{"$f":"IFERROR(VLOOKUP(A57,Hoja4!$A$2:$B$163,2,0),0)","v":0},{"$f":"IFERROR(VLOOKUP(A57,Hoja4!$D$2:$E$165,2,0),0)","v":0}]
[1302,{"$f":"IFERROR(VLOOKUP(A58,Hoja4!$A$2:$B$163,2,0),0)","v":0},{"$f":"IFERROR(VLOOKUP(A58,Hoja4!$D$2:$E$165,2,0),0)","v":0}]
[1303,{"$f":"IFERROR(VLOOKUP(A59,Hoja4!$A$2:$B$163,2,0),0)","v":0},{"$f":"IFERROR(VLOOKUP(A59,Hoja4!$D$2:$E$165,2,0),0)","v":0}]
[1304,{"$f":"IFERROR(VLOOKUP(A60,Hoja4!$A$2:$B$163,2,0),0)","v":0},{"$f":"IFERROR(VLOOKUP(A60,Hoja4!$D$2:$E$165,2,0),0)","v":0}]
[1305,{"$f":"IFERROR(VLOOKUP(A61,Hoja4!$A$2:$B$163,2,0),0)","v":0},{"$f":"IFERROR(VLOOKUP(A61,Hoja4!$D$2:$E$165,2,0),0)","v":0}]
[1306,{"$f":"IFERROR(VLOOKUP(A62,Hoja4!$A$2:$B$163,2,0),0)","v":0},{"$f":"IFERROR(VLOOKUP(A62,Hoja4!$D$2:$E$165,2,0),0)","v":0}]
[1308,{"$f":"IFERROR(VLOOKUP(A63,Hoja4!$A$2:$B$163,2,0),0)","v":0},{"$f":"IFERROR(VLOOKUP(A63,Hoja4!$D$2:$E$165,2,0),0)","v":0}]
[1309,{"$f":"IFERROR(VLOOKUP(A64,Hoja4!$A$2:$B$163,2,0),0)","v":0},{"$f":"IFERROR(VLOOKUP(A64,Hoja4!$D$2:$E$165,2,0),0)","v":0}]
[1310,{"$f":"IFERROR(VLOOKUP(A65,Hoja4!$A$2:$B$163,2,0),0)","v":0},{"$f":"IFERROR(VLOOKUP(A65,Hoja4!$D$2:$E$165,2,0),0)","v":0}]
[1312,{"$f":"IFERROR(VLOOKUP(A66,Hoja4!$A$2:$B$163,2,0),0)","v":0},{"$f":"IFERROR(VLOOKUP(A66,Hoja4!$D$2:$E$165,2,0),0)","v":0}]
[1314,{"$f":"IFERROR(VLOOKUP(A67,Hoja4!$A$2:$B$163,2,0),0)","v":0},{"$f":"IFERROR(VLOOKUP(A67,Hoja4!$D$2:$E$165,2,0),0)","v":0}]
[1315,{"$f":"IFERROR(VLOOKUP(A68,Hoja4!$A$2:$B$163,2,0),0)","v":0},{"$f":"IFERROR(VLOOKUP(A68,Hoja4!$D$2:$E$165,2,0),0)","v":0}]
[1318,{"$f":"IFERROR(VLOOKUP(A69,Hoja4!$A$2:$B$163,2,0),0)","v":0},{"$f":"IFERROR(VLOOKUP(A69,Hoja4!$D$2:$E$165,2,0),0)","v":0}]
[1321,{"$f":"IFERROR(VLOOKUP(A70,Hoja4!$A$2:$B$163,2,0),0)","v":0},{"$f":"IFERROR(VLOOKUP(A70,Hoja4!$D$2:$E$165,2,0),0)","v":0}]
[1322,{"$f":"IFERROR(VLOOKUP(A71,Hoja4!$A$2:$B$163,2,0),0)","v":0},{"$f":"IFERROR(VLOOKUP(A71,Hoja4!$D$2:$E$165,2,0),0)","v":0}]
[1323,{"$f":"IFERROR(VLOOKUP(A72,Hoja4!$A$2:$B$163,2,0),0)","v":0},{"$f":"IFERROR(VLOOKUP(A72,Hoja4!$D$2:$E$165,2,0),0)","v":0}]
[1324,{"$f":"IFERROR(VLOOKUP(A73,Hoja4!$A$2:$B$163,2,0),0)","v":0},{"$f":"IFERROR(VLOOKUP(A73,Hoja4!$D$2:$E$165,2,0),0)","v":0}]
[1325,{"$f":"IFERROR(VLOOKUP(A74,Hoja4!$A$2:$B$163,2,0),0)","v":0},{"$f":"IFERROR(VLOOKUP(A74,Hoja4!$D$2:$E$165,2,0),0)","v":0}]
[1327,{"$f":"IFERROR(VLOOKUP(A75,Hoja4!$A$2:$B$163,2,0),0)","v":0},{"$f":"IFERROR(VLOOKUP(A75,Hoja4!$D$2:$E$165,2,0),0)","v":0}]
[1329,{"$f":"IFERROR(VLOOKUP(A76,Hoja4!$A$2:$B$163,2,0),0)","v":0},{"$f":"IFERROR(VLOOKUP(A76,Hoja4!$D$2:$E$165,2,0),0)","v":0}]
[1331,{"$f":"IFERROR(VLOOKUP(A77,Hoja4!$A$2:$B$163,2,0),0)","v":0},{"$f":"IFERROR(VLOOKUP(A77,Hoja4!$D$2:$E$165,2,0),0)","v":0}]
[1336,{"$f":"IFERROR(VLOOKUP(A78,Hoja4!$A$2:$B$163,2,0),0)","v":0},{"$f":"IFERROR(VLOOKUP(A78,Hoja4!$D$2:$E$165,2,0),0)","v":0}]
[1337,{"$f":"IFERROR(VLOOKUP(A79,Hoja4!$A$2:$B$163,2,0),0)","v":0},{"$f":"IFERROR(VLOOKUP(A79,Hoja4!$D$2:$E$165,2,0),0)","v":0}]
[1338,{"$f":"IFERROR(VLOOKUP(A80,Hoja4!$A$2:$B$163,2,0),0)","v":0},{"$f":"IFERROR(VLOOKUP(A80,Hoja4!$D$2:$E$165,2,0),0)","v":0}]
{"$rows_left_out":478}
{"sheet":"Hoja4","index":2,"n_rows":165,"n_cols":5,"rows_kept":165,"cut":false,"hidden":false,"merged":[]}
["Nodo","Inyeccion",null,"Nodo","Retiro"]
[1101,228.126,null,1102,28.998000000000001]
[1102,24.591099999999997,null,1106,27.231000000000002]
[1106,3.7665999999999999,null,1107,141.916]
[1107,0,null,1108,155.47800000000001]
[1108,0,null,1109,228.24099999999999]
[1109,0,null,1120,2.0164]
[1120,0,null,1124,52.25]
[1124,0,null,1126,64.412800000000004]
[1126,0,null,1133,26.213000000000001]
[1133,0,null,1140,33.764000000000003]
[1140,125.8304,null,1145,13.842000000000001]
[1141,180.74199999999999,null,1165,0]
[1145,32.902000000000001,null,1166,0]
[1165,45.220999999999997,null,1168,0]
[1166,53.082999999999998,null,1219,0]
[1168,45.582999999999998,null,1444,28.382999999999999]
[1170,10.196999999999999,null,1710,99.807000000000002]
[1219,158.19499999999999,null,1771,34.094999999999999]
[1444,44.851999999999997,null,1840,0]
[1710,0,null,3029,44.225200000000001]
[1771,0,null,3030,41.179000000000002]
[1840,0,null,3031,22.068300000000001]
[1845,0,null,3032,2.0476000000000001]
[3029,3.673,null,3033,19.451899999999998]
[3032,162.4117,null,3034,37.936999999999998]
[3034,43.277999999999999,null,3036,0]
[3038,23.018999999999998,null,3037,66.546099999999996]
[3049,0,null,3038,25.543500000000002]
[3055,24.265000000000001,null,3040,23.514600000000002]
[3059,0,null,3045,37.880099999999999]
[3060,3.7549999999999999,null,3049,33.671199999999999]
[3078,0,null,3052,54.488199999999999]
[3082,5.6050000000000004,null,3055,73.107200000000006]
[3098,20,null,3060,39.245199999999997]
[3100,3.4009999999999998,null,3064,3.7082000000000002]
[3101,9.3249999999999993,null,3075,17.063099999999999]
[3123,9.8550000000000004,null,3077,40.723999999999997]
[3180,0.13600000000000001,null,3078,68.252499999999998]
[3183,6.4169999999999998,null,3082,9.2141000000000002]
[3203,23.855,null,3085,33.329900000000002]
[3204,202,null,3091,11.716699999999999]
[3211,70,null,3095,32.078699999999998]
[3213,70,null,3100,30.7136]
[3219,44,null,3101,69.162499999999994]
[3301,254,null,3103,15.584300000000001]
[3424,0,null,3108,18.9969]
[3544,5,null,3113,20.4757]
[3550,0,null,3118,9.6889000000000003]
[3553,152,null,3122,15.243]
[3592,50,null,3123,56.763300000000001]
[4300,0,null,3131,9.3277999999999999]
[4307,0.80500000000000005,null,3155,26.846]
[4315,0,null,3160,19.451899999999998]
[4316,44.655000000000001,null,3179,11.1479]
[4317,6.5138999999999996,null,3180,15.925599999999999]
[4319,0,null,3183,15.950700000000001]
[4328,22.8,null,3310,9.8965999999999994]
[4329,15,null,3408,22.2958]
[4330,36.1,null,3424,23.888400000000001]
[4331,33.5,null,3553,37.936999999999998]
[4336,37.92,null,4300,34.54]
[4341,67,null,4307,7.88]
[4342,22,null,4315,86.31]
[4402,3.95,null,4316,31.114000000000001]
[4403,0,null,4317,115.14999999999999]
[4405,141.91399999999999,null,4319,46.760000000000005]
[4406,0,null,4328,0]
[4419,108.416,null,4329,0.06]
[4750,9.1999999999999993,null,4330,18.45]
[4800,5.83,null,4331,68.8]
[4803,4.3,null,4336,120.14]
[6003,358.33,null,4341,5.73]
[6005,49.2,null,4342,5.59]
[6008,38.69,null,4357,11.53]
[6009,21.685199999999998,null,4402,0]
[6010,4.7030000000000003,null,4403,0]
[6011,31.6,null,4405,0.6]
[6013,17.119700000000002,null,4406,0]
[6018,0.27,null,4419,0.16]
{"$rows_left_out":86}
{"sheet":"oor","index":3,"n_rows":16,"n_cols":13,"rows_kept":16,"cut":false,"hidden":false,"merged":[]}
["N°","Nodo Retiro","Generador","Precio bloque 1","MW Ofertados Bloque 1","Precio Ofertado Bloque 1","MW Ofertados Bloque 2","Precio Ofertado Bloque 2","MW Ofertados Bloque 3","Precio Ofertado Bloque 3","MW Ofertados Bloque 4","Precio Ofertado Bloque 4","MW Ofertados Bloque 5"]
[1,"27211",1,41,10,36,5,0,0,0,0,0,0]
[2,"27211",1,35,10,30,5,20,5,0,0,0,0]
[3,"28181",1,1,1.016,0,0,0,0,0,0,0,0]
[4,"28161",1,9.9,15,0,0,0,0,0,0,0,0]
[5,"27211",1,2,7.5,1.5,7.5,1,5,0,0,0,0]
[6,"27131",1,40.450000000000003,20,39.450000000000003,10,37.450000000000003,10,0,0,0,0]
[7,"28161",1,42,10,0,0,0,0,0,0,0,0]
[8,"27131",1,30,15,28.5,4,0,0,0,0,0,0]
[10,"50900",1,77,130,72,{"$f":"47-13.77+2.21-0.35+0.06","v":35.150000000000006},0,0,0,0,0,0]
[11,"6005",1,27.83,28.6,0,0,0,0,0,0,0,0]
[12,"4403",1,77.010000000000005,20,0,0,0,0,0,0,0,0]
[13,"4403",1,77.010000000000005,20,0,0,0,0,0,0,0,0]
[14,"4403",1,77.010000000000005,3.2,0,0,0,0,0,0,0,0]
[15,"4403",1,77.010000000000005,9,0,0,0,0,0,0,0,0]
[16,"4402",1,75,1.6,0,0,0,0,0,0,0,0]

{"sheet":"ooi","index":4,"n_rows":53,"n_cols":13,"rows_kept":53,"cut":false,"hidden":false,"merged":[]}
["N°","Nodo Inyeccion","Generador","Precio bloque 1","MW Ofertados Bloque 1","Precio Ofertado Bloque 1","MW Ofertados Bloque 2","Precio Ofertado Bloque 2","MW Ofertados Bloque 3","Precio Ofertado Bloque 3","MW Ofertados Bloque 4","Precio Ofertado Bloque 4","MW Ofertados Bloque 5"]
[1,"1126",1,60.85,1,0,0,0,0,0,0,0,0]
[2,"1710",1,60.85,4.5369999999999999,0,0,0,0,0,0,0,0]
[3,"1710",1,59,2,0,0,0,0,0,0,0,0]
[4,"1710",1,57,4.835,0,0,0,0,0,0,0,0]
[5,"1124",1,171.9,4.0720000000000001,0,0,0,0,0,0,0,0]
[6,"1710",1,65,1.2,0,0,0,0,0,0,0,0]
[7,"1710",1,71,1.1000000000000001,0,0,0,0,0,0,0,0]
[8,"1126",1,58.5,2.8460000000000001,0,0,0,0,0,0,0,0]
[9,"1126",1,67,15.824999999999999,0,0,0,0,0,0,0,0]
[10,"1126",1,67,7.5,0,0,0,0,0,0,0,0]
[11,"1710",1,69.3,7.859,0,0,0,0,0,0,0,0]
[12,"1124",1,340.51,37.454999999999998,0,0,0,0,0,0,0,0]
[13,"1710",1,68,10,0,0,0,0,0,0,0,0]
[14,"1710",1,70,15.52,0,0,0,0,0,0,0,0]
[15,"1710",1,48,46.58,0,0,0,0,0,0,0,0]
[16,"1124",1,175.68,7.3090000000000002,0,0,0,0,0,0,0,0]
[17,"1124",1,145,35.392000000000003,0,0,0,0,0,0,0,0]
[18,"1710",1,79.17,24.3,0,0,0,0,0,0,0,0]
[19,"1710",1,59,13,0,0,0,0,0,0,0,0]
[20,"28181",1,60,10,62,5,0,0,0,0,0,0]
[21,"27301",1,60,10,65,5,70,10,0,0,0,0]
[22,"27301",1,60.99,30,70,20,0,0,0,0,0,0]
[23,"27461",1,57.46,15,59.5,5,0,0,0,0,0,0]
[24,"50350",1,196,9,0,0,0,0,0,0,0,0]
[25,"27461",1,200,7.5,220,7.5,0,0,0,0,0,0]
[26,"50900",1,190,17,0,0,0,0,0,0,0,0]
[27,"28181",1,60.92,17,62.92,8,0,0,0,0,0,0]
[28,"58200",1,208,13,0,0,0,0,0,0,0,0]
[29,"6059",1,225.66,31.198,0,0,0,0,0,0,0,0]
[30,"6059",1,236.59,26.619,0,0,0,0,0,0,0,0]
[31,"6059",1,84.21,22.8,0,0,0,0,0,0,0,0]
[32,"6059",1,135.59,29.132999999999999,0,0,0,0,0,0,0,0]
[33,"6171",1,77.62,12.711,0,0,0,0,0,0,0,0]
[34,"6173",1,84.16,17.727,0,0,0,0,0,0,0,0]
[35,"27461",1,60.54,20,62.54,10,64.760000000000005,10,66.760000000000005,10,0,0]
[36,"6290",1,213.9,46.482999999999997,0,0,0,0,0,0,0,0]
[37,"6290",1,217.41,46.113,0,0,0,0,0,0,0,0]
[38,"28181",1,58,15,61,15,0,0,0,0,0,0]
[39,"6018",1,45.75,1.9550000000000001,0,0,0,0,0,0,0,0]
[40,"6059",1,84.21,22.8,0,0,0,0,0,0,0,0]
[41,"6059",1,135.59,29.132999999999999,0,0,0,0,0,0,0,0]
[42,"6171",1,77.62,12.711,0,0,0,0,0,0,0,0]
[43,"6173",1,84.16,17.727,0,0,0,0,0,0,0,0]
[44,"3034",1,80,35,0,0,0,0,0,0,0,0]
[45,"6018",1,313.52,14.345000000000001,0,0,0,0,0,0,0,0]
[46,"6018",1,45.75,1.9550000000000001,0,0,0,0,0,0,0,0]
[47,"6059",1,84.21,22.8,0,0,0,0,0,0,0,0]
[48,"6059",1,135.59,29.132999999999999,0,0,0,0,0,0,0,0]
[49,"6171",1,77.62,12.711,0,0,0,0,0,0,0,0]
[50,"6173",1,84.16,17.727,0,0,0,0,0,0,0,0]
[51,"6018",1,45.75,1.9550000000000001,0,0,0,0,0,0,0,0]
[52,"6171",1,77.62,12.711,0,0,0,0,0,0,0,0]

{"sheet":"cf","index":5,"n_rows":6,"n_cols":16,"rows_kept":6,"cut":false,"hidden":false,"merged":[]}
["N°","Nodo Inyeccion","Generador","Nodo Retiro","MW Energía Declarada","MW Energía Requerida","Precio Ofertado Bloque 1","MW Ofertados Bloque 1","Precio Ofertado Bloque 2","MW Ofertados Bloque 2","Precio Ofertado Bloque 3","MW Ofertados Bloque 3","Precio Ofertado Bloque 4","MW Ofertados Bloque 4","Precio Ofertado Bloque 5","MW Ofertados Bloque 5"]
[1,1710,1,3183,3.61,3.61,30,3.61,0,0,0,0,0,0,0,0]
[2,1124,2,4403,35,35,35,35,0,0,0,0,0,0,0,0]
[3,6005,3,4750,12,12,0,12,0,0,0,0,0,0,0,0]
[4,6008,4,4750,25,25,38,25,0,0,0,0,0,0,0,0]
[5,6008,5,4750,12,12,38,12,0,0,0,0,0,0,0,0]

{"sheet":"cnfff","index":6,"n_rows":5,"n_cols":36,"rows_kept":5,"cut":false,"hidden":false,"merged":[]}
["N°","nodo_i","Generador","nodo_r","Energia declarada","Precio_i bloque 1","Magnitud_i bloque 1","Precio_i bloque 2","Magnitud_i bloque 2","Precio_i bloque 3","Magnitud_i bloque 3","Precio_i bloque 4","Magnitud_i bloque 4","Precio_i bloque 5","Magnitud_i bloque 5","Precio_r bloque 1","Magnitud_r bloque 1","Precio_i bloque r","Magnitud_r bloque 2","Precio_r bloque 3","Magnitud_r bloque 3","Precio_r bloque 4","Magnitud_r bloque 4","Precio_r bloque 5","Magnitud_r bloque 5","k","Precio_max_cvt bloque 1","Magnitud_max_cvt bloque 1","Precio_max_cvt bloque 2","Magnitud_max_cvt bloque 2","Precio_max_cvt bloque 3","Magnitud_max_cvt bloque 3","Precio_max_cvt bloque 4","Magnitud_max_cvt bloque 4","Precio_max_cvt bloque 5","Magnitud_max_cvt bloque 5"]
[1,1126,1,28161,7.5810000000000004,0,0,0,0,0,0,0,0,0,0,0,7.5810000000000004,0,0,0,0,0,0,0,0,0,0.02,7.1,0.01,0.48099999999999998,0,0,0,0,0,0]
[2,1126,1,28161,17.419,0,0,0,0,0,0,0,0,0,0,0,17.420000000000002,0,0,0,0,0,0,0,0,0,0.02,16.263000000000002,0.01,1.1559999999999999,0,0,0,0,0,0]
[3,1126,1,27461,19.38,75,19.38,0,0,0,0,0,0,0,0,0,0,0,0,0,0,0,0,0,0,0,0.01,19.38,0,0,0,0,0,0,0,0]
[4,1710,1,27401,29,122.39,29,0,0,0,0,0,0,0,0,32.619999999999997,29,0,0,0,0,0,0,0,0,0,0.75,29,0,0,0,0,0,0,0,0]