{"text_format":"2","workbook":"xlsx","n_sheets":7,"sheets":["rtr","g_m","Hoja4","oor","ooi","cf","cnfff"],"not_rendered":{"charts":0,"images":0,"macros":0,"external_links":0,"defined_names":5,"comments":0,"pivot_tables":0},"unopened":[],"bounds":{"document_bytes":16777216,"sheet_cells":100000,"run_cost":"one","rows_first":2000,"rows_last":500,"rows_between":2000,"halvings":0,"cell_chars":16384,"cell_head_chars":4096},"cells_cut":0,"cells_raw":0,"read":"whole","date_system":"1900"}

{"sheet":"rtr","index":0,"n_rows":834,"n_cols":7,"rows_kept":834,"cut":false,"hidden":false,"merged":[]}
["BUS_I","BUS_J","ID_CKT","X","R","CTOIJ","CTOJI"]
[4404,4800,"1",7.8299999999999995E-2,9.7999999999999997E-3,343,343]
[4330,4827,"1",2.1999999999999999E-2,5.7000000000000002E-3,142.5,142.5]
[4173,4800,"1",9.1800000000000007E-2,0,16,16]
[4800,4827,"1",5.6500000000000002E-2,0,114,114]
[4827,4173,"1",6.8699999999999997E-2,0,16,16]
[1101,1124,"2",2.6727999999999998E-2,4.1320000000000003E-3,396.4,396.4]
[4800,4832,"1",5.0000000000000001E-4,1E-4,343,343]
[4750,4832,"1",1.0999999999999999E-2,1.4E-3,343,343]
[4410,4800,"1",1.4E-3,2.0000000000000001E-4,98,98]
[4404,4803,"1",7.3999999999999996E-2,1.14E-2,240,240]
[1133,1444,"1",5.2975000000000001E-2,9.1739999999999999E-3,262.89999999999998,262.89999999999998]
[1102,1105,"1",4.0759999999999998E-2,8.7799999999999996E-3,294.5,294.5]
[1102,1106,"1",2.7999999999999998E-4,5.0000000000000002E-5,491.6,491.6]
[1102,1106,"2",3.6999999999999999E-4,1E-4,482.8,482.8]
[1102,1111,"1",1.83E-3,5.1999999999999995E-4,245.8,245.8]
[1103,1141,"1",5.5199999999999997E-3,1.07E-3,558.5,558.5]
[1103,1141,"2",5.5199999999999997E-3,1.07E-3,558.5,558.5]
[1106,1109,"1",3.0269999999999998E-2,5.8199999999999997E-3,491.6,491.6]
[1106,1132,"1",1.201E-2,2.2300000000000002E-3,491.6,491.6]
[1107,1108,"1",1.247E-2,2.4099999999999998E-3,558.5,558.5]
[1107,1109,"1",8.4899999999999993E-3,1.64E-3,558.5,558.5]
[1108,1444,"1",5.1139999999999998E-2,9.92E-3,558.5,558.5]
[1108,1444,"2",5.1139999999999998E-2,9.92E-3,558.5,558.5]
[1110,1119,"1",3.773E-2,4.7499999999999999E-3,424,424]
[1113,1115,"1",3.3090000000000001E-2,9.2399999999999999E-3,147.5,147.5]
[1114,1115,"2",8.1339999999999996E-2,2.3199999999999998E-2,167.6,167.6]
[1114,1122,"1",5.475E-2,1.562E-2,167.6,167.6]
[1115,1122,"1",2.6620000000000001E-2,7.6E-3,167.6,167.6]
[1120,1121,"1",2.802E-2,6.0200000000000002E-3,245.8,245.8]
[1126,1129,"2",1.4400000000000001E-3,2.7999999999999998E-4,558.5,558.5]
[1132,1219,"1",2.332E-2,3.5799999999999998E-3,365.54,365.54]
[1141,1444,"1",2.9950000000000001E-2,5.8199999999999997E-3,558.5,558.5]
[1141,1444,"2",2.9950000000000001E-2,5.8199999999999997E-3,558.5,558.5]
[1141,1845,"1",2.3439999999999999E-2,3.9199999999999999E-3,514.70000000000005,514.70000000000005]
[1141,1845,"2",2.3439999999999999E-2,3.9199999999999999E-3,514.70000000000005,514.70000000000005]
[1151,1240,"1",0.13503999999999999,3.8960000000000002E-2,73.7,73.7]
[1151,12177,"1",7.2940000000000005E-2,1.7690000000000001E-2,94.4,94.4]
[1151,12204,"1",1.7409999999999998E-2,4.4099999999999999E-3,94.4,94.4]
[1151,12205,"1",1.643E-2,4.1700000000000001E-3,94.41,94.41]
[1151,12241,"1",0.14893999999999999,4.2970000000000001E-2,73.7,73.7]
[1153,1408,"1",0.28094999999999998,8.1049999999999997E-2,83.8,83.8]
[1154,1204,"1",6.8930000000000005E-2,2.9569999999999999E-2,83.8,83.8]
[1154,1204,"2",6.6930000000000003E-2,2.0889999999999999E-2,83.8,83.8]
[1154,1204,"3",6.6930000000000003E-2,2.0889999999999999E-2,83.8,83.8]
[1154,12080,"1",1.6500000000000001E-2,5.1500000000000001E-3,83.8,83.8]
[1154,1159,"1",1.6389999999999998E-2,5.1200000000000004E-3,83.8,83.8]
[1154,1163,"1",6.3299999999999997E-3,1.5399999999999999E-3,94.41,94.41]
[1154,1425,"1",0.28261999999999998,0.11226999999999999,67.2,67.2]
[1159,1331,"1",0.12021,3.7519999999999998E-2,83.8,83.8]
[4122,4403,"1",9.1800000000000007E-2,0,16,16]
[4316,4122,"1",6.8699999999999997E-2,0,16,16]
[4403,4316,"1",5.6500000000000002E-2,0,114,114]
[6059,6684,"51",2.0902E-2,4.4970000000000001E-3,156,156]
[4124,4403,"2",9.1800000000000007E-2,0,16,16]
[4316,4124,"2",6.8699999999999997E-2,0,16,16]
[4403,4316,"2",5.6500000000000002E-2,0,114,114]
[3211,29181,"1",1.7420000000000001E-2,2.751E-3,317.3,317.3]
[6003,6470,"2B",8.0719999999999993E-3,2.676E-3,225,225]
[1101,1908,"1",1.4645E-2,1.977E-3,453.7,453.7]
{"$rows_left_out":775}
{"sheet":"g_m","index":1,"n_rows":557,"n_cols":3,"rows_kept":557,"cut":false,"hidden":false,"merged":[]}
["Nodo","Generacion","Demanda"]
[1101,{"$f":"IFERROR(VLOOKUP(A2,Hoja4!$A$2:$B$163,2,0),0)","v":256.24789999999996},{"$f":"IFERROR(VLOOKUP(A2,Hoja4!$D$2:$E$166,2,0),0)","v":0}]
[1102,{"$f":"IFERROR(VLOOKUP(A3,Hoja4!$A$2:$B$163,2,0),0)","v":20.49},{"$f":"IFERROR(VLOOKUP(A3,Hoja4!$D$2:$E$166,2,0),0)","v":36.238}]
[1103,{"$f":"IFERROR(VLOOKUP(A4,Hoja4!$A$2:$B$163,2,0),0)","v":0},{"$f":"IFERROR(VLOOKUP(A4,Hoja4!$D$2:$E$166,2,0),0)","v":0}]
[1105,{"$f":"IFERROR(VLOOKUP(A5,Hoja4!$A$2:$B$163,2,0),0)","v":0},{"$f":"IFERROR(VLOOKUP(A5,Hoja4!$D$2:$E$166,2,0),0)","v":0}]
[1106,{"$f":"IFERROR(VLOOKUP(A6,Hoja4!$A$2:$B$163,2,0),0)","v":0},{"$f":"IFERROR(VLOOKUP(A6,Hoja4!$D$2:$E$166,2,0),0)","v":36.290999999999997}]
[1107,{"$f":"IFERROR(VLOOKUP(A7,Hoja4!$A$2:$B$163,2,0),0)","v":0},{"$f":"IFERROR(VLOOKUP(A7,Hoja4!$D$2:$E$166,2,0),0)","v":143.10499999999999}]
[1108,{"$f":"IFERROR(VLOOKUP(A8,Hoja4!$A$2:$B$163,2,0),0)","v":0},{"$f":"IFERROR(VLOOKUP(A8,Hoja4!$D$2:$E$166,2,0),0)","v":155.583}]
[1109,{"$f":"IFERROR(VLOOKUP(A9,Hoja4!$A$2:$B$163,2,0),0)","v":0},{"$f":"IFERROR(VLOOKUP(A9,Hoja4!$D$2:$E$166,2,0),0)","v":207.28100000000001}]
[1110,{"$f":"IFERROR(VLOOKUP(A10,Hoja4!$A$2:$B$163,2,0),0)","v":0},{"$f":"IFERROR(VLOOKUP(A10,Hoja4!$D$2:$E$166,2,0),0)","v":0}]
[1111,{"$f":"IFERROR(VLOOKUP(A11,Hoja4!$A$2:$B$163,2,0),0)","v":0},{"$f":"IFERROR(VLOOKUP(A11,Hoja4!$D$2:$E$166,2,0),0)","v":0}]
[1113,{"$f":"IFERROR(VLOOKUP(A12,Hoja4!$A$2:$B$163,2,0),0)","v":0},{"$f":"IFERROR(VLOOKUP(A12,Hoja4!$D$2:$E$166,2,0),0)","v":0}]
[1114,{"$f":"IFERROR(VLOOKUP(A13,Hoja4!$A$2:$B$163,2,0),0)","v":0},{"$f":"IFERROR(VLOOKUP(A13,Hoja4!$D$2:$E$166,2,0),0)","v":0}]
[1115,{"$f":"IFERROR(VLOOKUP(A14,Hoja4!$A$2:$B$163,2,0),0)","v":0},{"$f":"IFERROR(VLOOKUP(A14,Hoja4!$D$2:$E$166,2,0),0)","v":0}]
[1117,{"$f":"IFERROR(VLOOKUP(A15,Hoja4!$A$2:$B$163,2,0),0)","v":0},{"$f":"IFERROR(VLOOKUP(A15,Hoja4!$D$2:$E$166,2,0),0)","v":0}]
[1119,{"$f":"IFERROR(VLOOKUP(A16,Hoja4!$A$2:$B$163,2,0),0)","v":0},{"$f":"IFERROR(VLOOKUP(A16,Hoja4!$D$2:$E$166,2,0),0)","v":0}]
[1120,{"$f":"IFERROR(VLOOKUP(A17,Hoja4!$A$2:$B$163,2,0),0)","v":17.417999999999999},{"$f":"IFERROR(VLOOKUP(A17,Hoja4!$D$2:$E$166,2,0),0)","v":0}]
[1121,{"$f":"IFERROR(VLOOKUP(A18,Hoja4!$A$2:$B$163,2,0),0)","v":0},{"$f":"IFERROR(VLOOKUP(A18,Hoja4!$D$2:$E$166,2,0),0)","v":0}]
[1122,{"$f":"IFERROR(VLOOKUP(A19,Hoja4!$A$2:$B$163,2,0),0)","v":0},{"$f":"IFERROR(VLOOKUP(A19,Hoja4!$D$2:$E$166,2,0),0)","v":0}]
[1124,{"$f":"IFERROR(VLOOKUP(A20,Hoja4!$A$2:$B$163,2,0),0)","v":0},{"$f":"IFERROR(VLOOKUP(A20,Hoja4!$D$2:$E$166,2,0),0)","v":35.914000000000001}]
[1126,{"$f":"IFERROR(VLOOKUP(A21,Hoja4!$A$2:$B$163,2,0),0)","v":0},{"$f":"IFERROR(VLOOKUP(A21,Hoja4!$D$2:$E$166,2,0),0)","v":50.213000000000001}]
[1128,{"$f":"IFERROR(VLOOKUP(A22,Hoja4!$A$2:$B$163,2,0),0)","v":0},{"$f":"IFERROR(VLOOKUP(A22,Hoja4!$D$2:$E$166,2,0),0)","v":0}]
[1129,{"$f":"IFERROR(VLOOKUP(A23,Hoja4!$A$2:$B$163,2,0),0)","v":0},{"$f":"IFERROR(VLOOKUP(A23,Hoja4!$D$2:$E$166,2,0),0)","v":0}]
[1131,{"$f":"IFERROR(VLOOKUP(A24,Hoja4!$A$2:$B$163,2,0),0)","v":0},{"$f":"IFERROR(VLOOKUP(A24,Hoja4!$D$2:$E$166,2,0),0)","v":0}]
[1132,{"$f":"IFERROR(VLOOKUP(A25,Hoja4!$A$2:$B$163,2,0),0)","v":0},{"$f":"IFERROR(VLOOKUP(A25,Hoja4!$D$2:$E$166,2,0),0)","v":0}]
[1133,{"$f":"IFERROR(VLOOKUP(A26,Hoja4!$A$2:$B$163,2,0),0)","v":0},{"$f":"IFERROR(VLOOKUP(A26,Hoja4!$D$2:$E$166,2,0),0)","v":19.166}]
[1140,{"$f":"IFERROR(VLOOKUP(A27,Hoja4!$A$2:$B$163,2,0),0)","v":127.8661},{"$f":"IFERROR(VLOOKUP(A27,Hoja4!$D$2:$E$166,2,0),0)","v":35.988}]
[1141,{"$f":"IFERROR(VLOOKUP(A28,Hoja4!$A$2:$B$163,2,0),0)","v":228.58},{"$f":"IFERROR(VLOOKUP(A28,Hoja4!$D$2:$E$166,2,0),0)","v":0}]
[1145,{"$f":"IFERROR(VLOOKUP(A29,Hoja4!$A$2:$B$163,2,0),0)","v":8.8626000000000005},{"$f":"IFERROR(VLOOKUP(A29,Hoja4!$D$2:$E$166,2,0),0)","v":0}]
[1151,{"$f":"IFERROR(VLOOKUP(A30,Hoja4!$A$2:$B$163,2,0),0)","v":0},{"$f":"IFERROR(VLOOKUP(A30,Hoja4!$D$2:$E$166,2,0),0)","v":0}]
[1153,{"$f":"IFERROR(VLOOKUP(A31,Hoja4!$A$2:$B$163,2,0),0)","v":0},{"$f":"IFERROR(VLOOKUP(A31,Hoja4!$D$2:$E$166,2,0),0)","v":0}]
[1154,{"$f":"IFERROR(VLOOKUP(A32,Hoja4!$A$2:$B$163,2,0),0)","v":0},{"$f":"IFERROR(VLOOKUP(A32,Hoja4!$D$2:$E$166,2,0),0)","v":0}]
[1155,{"$f":"IFERROR(VLOOKUP(A33,Hoja4!$A$2:$B$163,2,0),0)","v":0},{"$f":"IFERROR(VLOOKUP(A33,Hoja4!$D$2:$E$166,2,0),0)","v":0}]
[1159,{"$f":"IFERROR(VLOOKUP(A34,Hoja4!$A$2:$B$163,2,0),0)","v":0},{"$f":"IFERROR(VLOOKUP(A34,Hoja4!$D$2:$E$166,2,0),0)","v":0}]
[1163,{"$f":"IFERROR(VLOOKUP(A35,Hoja4!$A$2:$B$163,2,0),0)","v":0},{"$f":"IFERROR(VLOOKUP(A35,Hoja4!$D$2:$E$166,2,0),0)","v":0}]
[1164,{"$f":"IFERROR(VLOOKUP(A36,Hoja4!$A$2:$B$163,2,0),0)","v":0},{"$f":"IFERROR(VLOOKUP(A36,Hoja4!$D$2:$E$166,2,0),0)","v":0}]
[1165,{"$f":"IFERROR(VLOOKUP(A37,Hoja4!$A$2:$B$163,2,0),0)","v":49.567999999999998},{"$f":"IFERROR(VLOOKUP(A37,Hoja4!$D$2:$E$166,2,0),0)","v":0}]
[1166,{"$f":"IFERROR(VLOOKUP(A38,Hoja4!$A$2:$B$163,2,0),0)","v":0},{"$f":"IFERROR(VLOOKUP(A38,Hoja4!$D$2:$E$166,2,0),0)","v":0}]
[1168,{"$f":"IFERROR(VLOOKUP(A39,Hoja4!$A$2:$B$163,2,0),0)","v":47.957000000000001},{"$f":"IFERROR(VLOOKUP(A39,Hoja4!$D$2:$E$166,2,0),0)","v":0}]
[1169,{"$f":"IFERROR(VLOOKUP(A40,Hoja4!$A$2:$B$163,2,0),0)","v":0},{"$f":"IFERROR(VLOOKUP(A40,Hoja4!$D$2:$E$166,2,0),0)","v":0}]
[1170,{"$f":"IFERROR(VLOOKUP(A41,Hoja4!$A$2:$B$163,2,0),0)","v":2.1194000000000002},{"$f":"IFERROR(VLOOKUP(A41,Hoja4!$D$2:$E$166,2,0),0)","v":0}]
[1174,{"$f":"IFERROR(VLOOKUP(A42,Hoja4!$A$2:$B$163,2,0),0)","v":0},{"$f":"IFERROR(VLOOKUP(A42,Hoja4!$D$2:$E$166,2,0),0)","v":0}]
[1204,{"$f":"IFERROR(VLOOKUP(A43,Hoja4!$A$2:$B$163,2,0),0)","v":0},{"$f":"IFERROR(VLOOKUP(A43,Hoja4!$D$2:$E$166,2,0),0)","v":0}]
[1206,{"$f":"IFERROR(VLOOKUP(A44,Hoja4!$A$2:$B$163,2,0),0)","v":0},{"$f":"IFERROR(VLOOKUP(A44,Hoja4!$D$2:$E$166,2,0),0)","v":0}]
[1207,{"$f":"IFERROR(VLOOKUP(A45,Hoja4!$A$2:$B$163,2,0),0)","v":0},{"$f":"IFERROR(VLOOKUP(A45,Hoja4!$D$2:$E$166,2,0),0)","v":0}]
[1215,{"$f":"IFERROR(VLOOKUP(A46,Hoja4!$A$2:$B$163,2,0),0)","v":0},{"$f":"IFERROR(VLOOKUP(A46,Hoja4!$D$2:$E$166,2,0),0)","v":0}]
[1216,{"$f":"IFERROR(VLOOKUP(A47,Hoja4!$A$2:$B$163,2,0),0)","v":0},{"$f":"IFERROR(VLOOKUP(A47,Hoja4!$D$2:$E$166,2,0),0)","v":0}]
[1217,{"$f":"IFERROR(VLOOKUP(A48,Hoja4!$A$2:$B$163,2,0),0)","v":0},{"$f":"IFERROR(VLOOKUP(A48,Hoja4!$D$2:$E$166,2,0),0)","v":0}]
[1218,{"$f":"IFERROR(VLOOKUP(A49,Hoja4!$A$2:$B$163,2,0),0)","v":0},{"$f":"IFERROR(VLOOKUP(A49,Hoja4!$D$2:$E$166,2,0),0)","v":0}]
[1219,{"$f":"IFERROR(VLOOKUP(A50,Hoja4!$A$2:$B$163,2,0),0)","v":68.570999999999998},{"$f":"IFERROR(VLOOKUP(A50,Hoja4!$D$2:$E$166,2,0),0)","v":0}]
[1220,{"$f":"IFERROR(VLOOKUP(A51,Hoja4!$A$2:$B$163,2,0),0)","v":0},{"$f":"IFERROR(VLOOKUP(A51,Hoja4!$D$2:$E$166,2,0),0)","v":0}]
[1223,{"$f":"IFERROR(VLOOKUP(A52,Hoja4!$A$2:$B$163,2,0),0)","v":0},{"$f":"IFERROR(VLOOKUP(A52,Hoja4!$D$2:$E$166,2,0),0)","v":0}]
[1240,{"$f":"IFERROR(VLOOKUP(A53,Hoja4!$A$2:$B$163,2,0),0)","v":0},{"$f":"IFERROR(VLOOKUP(A53,Hoja4!$D$2:$E$166,2,0),0)","v":0}]
[1241,{"$f":"IFERROR(VLOOKUP(A54,Hoja4!$A$2:$B$163,2,0),0)","v":0},{"$f":"IFERROR(VLOOKUP(A54,Hoja4!$D$2:$E$166,2,0),0)","v":0}]
[1249,{"$f":"IFERROR(VLOOKUP(A55,Hoja4!$A$2:$B$163,2,0),0)","v":0},{"$f":"IFERROR(VLOOKUP(A55,Hoja4!$D$2:$E$166,2,0),0)","v":0}]
[1251,{"$f":"IFERROR(VLOOKUP(A56,Hoja4!$A$2:$B$163,2,0),0)","v":0},{"$f":"IFERROR(VLOOKUP(A56,Hoja4!$D$2:$E$166,2,0),0)","v":0}]
[1301,{"$f":"IFERROR(VLOOKUP(A57,Hoja4!$A$2:$B$163,2,0),0)","v":0},{"$f":"IFERROR(VLOOKUP(A57,Hoja4!$D$2:$E$166,2,0),0)","v":0}]
[1302,{"$f":"IFERROR(VLOOKUP(A58,Hoja4!$A$2:$B$163,2,0),0)","v":0},{"$f":"IFERROR(VLOOKUP(A58,Hoja4!$D$2:$E$166,2,0),0)","v":0}]
[1303,{"$f":"IFERROR(VLOOKUP(A59,Hoja4!$A$2:$B$163,2,0),0)","v":0},{"$f":"IFERROR(VLOOKUP(A59,Hoja4!$D$2:$E$166,2,0),0)","v":0}]
[1304,{"$f":"IFERROR(VLOOKUP(A60,Hoja4!$A$2:$B$163,2,0),0)","v":0},{"$f":"IFERROR(VLOOKUP(A60,Hoja4!$D$2:$E$166,2,0),0)","v":0}]
{"$rows_left_out":498}
{"sheet":"Hoja4","index":2,"n_rows":170,"n_cols":5,"rows_kept":170,"cut":false,"hidden":false,"merged":[]}
["Nodo","Inyeccion",null,"Nodo","Retiro"]
[1101,256.24789999999996,null,1102,36.238]
[1102,20.49,null,1106,36.290999999999997]
[1106,0,null,1107,143.10499999999999]
[1107,0,null,1108,155.583]
[1108,0,null,1109,207.28100000000001]
[1109,0,null,1120,0]
[1120,17.417999999999999,null,1124,35.914000000000001]
[1124,0,null,1126,50.213000000000001]
[1126,0,null,1133,19.166]
[1133,0,null,1140,35.988]
[1140,127.8661,null,1145,0]
[1141,228.58,null,1165,0]
[1145,8.8626000000000005,null,1166,0]
[1165,49.567999999999998,null,1168,0]
[1166,0,null,1219,0]
[1168,47.957000000000001,null,1444,21.9]
[1170,2.1194000000000002,null,1710,68.656999999999996]
[1219,68.570999999999998,null,1771,36.027000000000001]
[1444,33.241,null,1840,32.68]
[1710,0,null,3029,40.061900000000001]
[1771,0,null,3030,37.302500000000002]
[1840,33.026000000000003,null,3031,19.9908]
[1845,0,null,3032,1.8548]
[3029,30.568000000000001,null,3033,17.620799999999999]
[3032,124.9973,null,3034,30.032699999999998]
[3034,99.774000000000001,null,3036,0]
[3038,22.923999999999999,null,3037,60.281700000000001]
[3049,0,null,3038,23.1389]
[3055,21.172000000000001,null,3040,11.231999999999999]
[3059,0,null,3045,34.3142]
[3060,3.6469999999999998,null,3049,30.5015]
[3078,0,null,3052,49.358800000000002]
[3082,5.4450000000000003,null,3055,66.225099999999998]
[3098,39,null,3060,35.550699999999999]
[3100,3.3039999999999998,null,3064,3.3591000000000002]
[3101,9.3249999999999993,null,3075,15.456799999999999]
[3123,9.8550000000000004,null,3077,36.890300000000003]
[3180,0.13200000000000001,null,3078,61.827399999999997]
[3183,6.2329999999999997,null,3082,8.3467000000000002]
[3203,10.855,null,3085,30.192399999999999]
[3204,227,null,3091,10.6137]
[3211,8,null,3095,29.058900000000001]
[3213,70,null,3100,27.822299999999998]
[3219,30,null,3101,62.651699999999998]
[3301,241,null,3103,14.1172]
[3424,0,null,3108,17.208600000000001]
[3544,8,null,3113,18.548200000000001]
[3550,18,null,3118,8.7767999999999997]
[3553,56,null,3122,13.8081]
[3592,8,null,3123,51.419800000000002]
[4300,0,null,3131,8.4497]
[4307,3.62,null,3155,24.3188]
[4315,0,null,3160,17.620799999999999]
[4316,49.126999999999995,null,3179,10.0985]
[4317,9.8572000000000006,null,3180,14.426399999999999]
[4319,0,null,3183,14.449200000000001]
[4328,22.8,null,3310,8.9650000000000034]
[4329,0,null,3408,20.196899999999999]
[4330,25.65,null,3424,21.639600000000002]
{"$rows_left_out":111}
{"sheet":"oor","index":3,"n_rows":19,"n_cols":13,"rows_kept":19,"cut":false,"hidden":false,"merged":[]}
["N°","Nodo Retiro","Generador","Precio bloque 1","MW Ofertados Bloque 1","Precio Ofertado Bloque 1","MW Ofertados Bloque 2","Precio Ofertado Bloque 2","MW Ofertados Bloque 3","Precio Ofertado Bloque 3","MW Ofertados Bloque 4","Precio Ofertado Bloque 4","MW Ofertados Bloque 5"]
[1,1124,1,61.87,40,0,0,0,0,0,0,0,0]
[2,27131,1,34.200000000000003,20,33.200000000000003,20,32.200000000000003,10,0,0,0,0]
[3,27131,1,35.06,10,34.99,5,0,0,0,0,0,0]
[4,27161,1,36.33,25,34.33,10,0,0,0,0,0,0]
[5,27211,1,25,10,20,5,10,5,0,0,0,0]
[6,27211,1,32.51,7.5,31.64,7.5,1,5,0,0,0,0]
[7,27211,1,35.06,10,34.99,5,0,0,0,0,0,0]
[8,28161,1,32.81,5,0,0,0,0,0,0,0,0]
[9,28161,1,35.15,30,34.15,15,0,0,0,0,0,0]
[10,28161,1,35,10,0,0,0,0,0,0,0,0]
[11,28181,1,32.81,5,0,0,0,0,0,0,0,0]
[12,28181,1,1,0.98399999999999999,0,0,0,0,0,0,0,0]
[13,3034,1,50,25,0,0,0,0,0,0,0,0]
[14,3310,1,50,25,0,0,0,0,0,0,0,0]
[15,4402,1,50,2,0,0,0,0,0,0,0,0]
[16,4403,1,53,9.1999999999999993,0,0,0,0,0,0,0,0]
[17,4403,1,53,3.2,0,0,0,0,0,0,0,0]
[18,6096,1,37.049999999999997,210,0,0,0,0,0,0,0,0]

{"sheet":"ooi","index":4,"n_rows":64,"n_cols":13,"rows_kept":64,"cut":false,"hidden":false,"merged":[]}
["N°","Nodo Inyeccion","Generador","Precio bloque 1","MW Ofertados Bloque 1","Precio Ofertado Bloque 1","MW Ofertados Bloque 2","Precio Ofertado Bloque 2","MW Ofertados Bloque 3","Precio Ofertado Bloque 3","MW Ofertados Bloque 4","Precio Ofertado Bloque 4","MW Ofertados Bloque 5"]
[1,1124,1,259,23.47,0,0,0,0,0,0,0,0]
[2,1124,1,340.51,37.454999999999998,0,0,0,0,0,0,0,0]
[3,1124,1,145,93.84,0,0,0,0,0,0,0,0]
[4,1124,1,209.08,22.388999999999999,0,0,0,0,0,0,0,0]
[5,1126,1,198,16.568000000000001,0,0,0,0,0,0,0,0]
[6,1126,1,76.48,0.53800000000000003,0,0,0,0,0,0,0,0]
[7,1710,1,88,1.33,0,0,0,0,0,0,0,0]
[8,1710,1,65,1.2,0,0,0,0,0,0,0,0]
[10,1710,1,88,1.32,0,0,0,0,0,0,0,0]
[11,1710,1,71,1.1000000000000001,0,0,0,0,0,0,0,0]
[12,1710,1,65,2.9049999999999998,0,0,0,0,0,0,0,0]
[13,1710,1,76.48,4.5369999999999999,0,0,0,0,0,0,0,0]
[14,1710,1,65,15.26,0,0,0,0,0,0,0,0]
[15,27161,1,54.17,5,59.17,5,0,0,0,0,0,0]
[16,27301,1,51,10,56,5,61,10,0,0,0,0]
[17,27301,1,58.99,15,0,0,0,0,0,0,0,0]
[18,27301,1,52.3,15,54,10,0,0,0,0,0,0]
[19,27301,1,50.67,8,51.5,5,52,5,0,0,0,0]
[20,27461,1,54.14,20,55.14,20,56.14,10,57.14,20,0,0]
[21,27461,1,54.75,7.5,57.35,7.5,0,0,0,0,0,0]
[22,28161,1,53.1,3,0,0,0,0,0,0,0,0]
[23,28161,1,57.04,17,59.04,5,0,0,0,0,0,0]
[24,28181,1,53.1,10,0,0,0,0,0,0,0,0]
[25,28181,1,58.85,5,0,0,0,0,0,0,0,0]
[26,28181,1,57.04,17,59.04,5,0,0,0,0,0,0]
[27,50350,1,196,9,0,0,0,0,0,0,0,0]
[28,50900,1,190,106,0,0,0,0,0,0,0,0]
[29,58200,1,208,13,0,0,0,0,0,0,0,0]
[30,6003,1,63.12,13.951000000000001,0,0,0,0,0,0,0,0]
[31,6003,1,63.12,13.951000000000001,0,0,0,0,0,0,0,0]
[32,6003,1,63.12,13.951000000000001,0,0,0,0,0,0,0,0]
[33,6003,1,63.12,13.951000000000001,0,0,0,0,0,0,0,0]
[34,6003,1,63.12,13.951000000000001,0,0,0,0,0,0,0,0]
[35,6018,1,354.87,14.345000000000002,0,0,0,0,0,0,0,0]
[36,6059,1,258.23,31.198,0,0,0,0,0,0,0,0]
[37,6059,1,270.25,26.619,0,0,0,0,0,0,0,0]
[38,6059,1,84.21,13.68,0,0,0,0,0,0,0,0]
[39,6059,1,84.21,13.68,0,0,0,0,0,0,0,0]
[40,6059,1,84.21,13.68,0,0,0,0,0,0,0,0]
[41,6059,1,135.59,17.48,0,0,0,0,0,0,0,0]
[42,6059,1,135.59,17.48,0,0,0,0,0,0,0,0]
[43,6059,1,135.59,17.48,0,0,0,0,0,0,0,0]
[44,6059,1,135.59,17.48,0,0,0,0,0,0,0,0]
[45,6059,1,84.21,13.68,0,0,0,0,0,0,0,0]
[46,6059,1,135.59,17.48,0,0,0,0,0,0,0,0]
[47,6059,1,84.21,13.68,0,0,0,0,0,0,0,0]
[48,6100,1,44.93,37.158999999999999,0,0,0,0,0,0,0,0]
[49,6100,1,44.93,37.158999999999999,0,0,0,0,0,0,0,0]
[50,6100,1,44.93,37.158999999999999,0,0,0,0,0,0,0,0]
[51,6100,1,44.93,37.158999999999999,0,0,0,0,0,0,0,0]
[52,6100,1,44.93,37.158999999999999,0,0,0,0,0,0,0,0]
[53,6171,1,77.62,10.167999999999999,0,0,0,0,0,0,0,0]
[54,6171,1,77.62,10.167999999999999,0,0,0,0,0,0,0,0]
[55,6171,1,77.62,10.167999999999999,0,0,0,0,0,0,0,0]
[56,6171,1,77.62,10.167999999999999,0,0,0,0,0,0,0,0]
[57,6171,1,77.62,10.167999999999999,0,0,0,0,0,0,0,0]
[58,6173,1,84.16,10.635999999999999,0,0,0,0,0,0,0,0]
[59,6173,1,84.16,10.635999999999999,0,0,0,0,0,0,0,0]
[60,6173,1,84.16,10.635999999999999,0,0,0,0,0,0,0,0]
{"$rows_left_out":5}
{"sheet":"cf","index":5,"n_rows":6,"n_cols":16,"rows_kept":6,"cut":false,"hidden":false,"merged":[]}
["N°","Nodo Inyeccion","Generador","Nodo Retiro","MW Energía Declarada","MW Energía Requerida","Precio Ofertado Bloque 1","MW Ofertados Bloque 1","Precio Ofertado Bloque 2","MW Ofertados Bloque 2","Precio Ofertado Bloque 3","MW Ofertados Bloque 3","Precio Ofertado Bloque 4","MW Ofertados Bloque 4","Precio Ofertado Bloque 5","MW Ofertados Bloque 5"]
[1,1710,"3_3183_005",3183,5.91,5.91,35,5.91,0,0,0,0,0,0,0,0]
[2,1124,"4_4403_119",4403,35,35,45.15,35,0,0,0,0,0,0,0,0]
[3,6005,"4_4750_005",4750,12,12,0,12,0,0,0,0,0,0,0,0]
[4,6008,"4_4750_136",4750,25,25,38,25,0,0,0,0,0,0,0,0]
[5,6008,"4_4750_129",4750,12,12,38,12,0,0,0,0,0,0,0,0]

{"sheet":"cnfff","index":6,"n_rows":10,"n_cols":36,"rows_kept":10,"cut":false,"hidden":false,"merged":[]}
["N°","nodo_i","Generador","nodo_r","Energia declarada","Precio_i bloque 1","Magnitud_i bloque 1","Precio_i bloque 2","Magnitud_i bloque 2","Precio_i bloque 3","Magnitud_i bloque 3","Precio_i bloque 4","Magnitud_i bloque 4","Precio_i bloque 5","Magnitud_i bloque 5","Precio_r bloque 1","Magnitud_r bloque 1","Precio_i bloque r","Magnitud_r bloque 2","Precio_r bloque 3","Magnitud_r bloque 3","Precio_r bloque 4","Magnitud_r bloque 4","Precio_r bloque 5","Magnitud_r bloque 5","k","Precio_max_cvt bloque 1","Magnitud_max_cvt bloque 1","Precio_max_cvt bloque 2","Magnitud_max_cvt bloque 2","Precio_max_cvt bloque 3","Magnitud_max_cvt bloque 3","Precio_max_cvt bloque 4","Magnitud_max_cvt bloque 4","Precio_max_cvt bloque 5","Magnitud_max_cvt bloque 5"]
[1,27301,"2_27301_190",1124,20,0,0,0,0,0,0,0,0,0,0,60,20,0,0,0,0,0,0,0,0,0,0.1,20,0,0,0,0,0,0,0,0]
[2,28161,"2_28161_660",1124,15,0,0,0,0,0,0,0,0,0,0,60,15,0,0,0,0,0,0,0,0,0,0.01,15,0,0,0,0,0,0,0,0]
[3,6018,"6_6018_195",27301,7.274,40,7.274,0,0,0,0,0,0,0,0,0,0,0,0,0,0,0,0,0,0,0,0.01,7.274,0,0,0,0,0,0,0,0]
[4,6100,"6_6100_061",27301,7.726,40,7.726,0,0,0,0,0,0,0,0,0,0,0,0,0,0,0,0,0,0,0,0.01,7.726,0,0,0,0,0,0,0,0]
[5,1710,"1_1710_898",27401,23,122.39,23,0,0,0,0,0,0,0,0,37.299999999999997,23,0,0,0,0,0,0,0,0,0,1,23,0,0,0,0,0,0,0,0]
[6,6100,"6_6100_013",27461,2.5750000000000002,43,{"$f":"E7","v":2.5750000000000002},0,0,0,0,0,0,0,0,0,0,0,0,0,0,0,0,0,0,0,0.01,2.5750000000000002,0,0,0,0,0,0,0,0]
[7,6018,"6_6018_205",27461,2.4249999999999998,43,{"$f":"E8","v":2.4249999999999998},0,0,0,0,0,0,0,0,0,0,0,0,0,0,0,0,0,0,0,0.01,2.4249999999999998,0,0,0,0,0,0,0,0]
[8,6018,"6_6018_206",27461,3.2,43,3.2,0,0,0,0,0,0,0,0,0,0,0,0,0,0,0,0,0,0,0,0.01,3.2,0,0,0,0,0,0,0,0]
[9,6100,"6_6100_014",27461,3.4,43,3.4,0,0,0,0,0,0,0,0,0,0,0,0,0,0,0,0,0,0,0,0.01,3.4,0,0,0,0,0,0,0,0]